Bevolking
type: Concept
narrower: Leeftijd

Leeftijd
type: Concept
type: CBS begrip
in scheme: Begrippen CBS
preferred label: Age @en
definition: Het aantal gehele jaren dat is verstreken sinds de geboortedatum van de persoon.
definition: The number of whole years that have passed since someone’s date of birth. @en
version info: 1
broader: Bevolking
scope note: Er worden twee standaardomschrijvingen onderscheiden, nl. de leeftijd op 31 december en de exacte leeftijd.
source: leeftijd
modified: 2022-02-23T15:54:13Z
created: 2016-03-23T09:06:51Z

CBS begrip
label: CBS concept @en

Begrippen CBS
type: ConceptScheme
preferred label: Concepts Statistics Netherlands @en