Diensten
type: Concept
narrower: Monetaire financiële instellingen

Institutionele sector
type: Concept
related: Monetaire financiële instellingen
type: CBS begrip
preferred label: Institutional sector @en

Financiële instellingen
type: Concept
related: Monetaire financiële instellingen
type: CBS begrip
preferred label: Sector financial corporations @en

Monetaire financiële instellingen
type: Concept
type: CBS begrip
in scheme: Begrippen CBS
preferred label: Sector monetary financial institutions (MFI) @en
alternative label: Sector monetaire financiële instellingen
alternative label: MFI
definition: The sector consisting of all financial institutions and quasi corporations that have financial mediation as their core business and that have deposits and/or comparable financial titles of institutional units that are non-financial institutions, and provide credit and/or buy securities for their own account. @en
definition: Financiële instellingen die deposito’s of sterk op deposito’s lijkende financiële producten in ontvangst nemen. De monetaire financiële instellingen bestaan uit de centrale bank, geldscheppende instellingen onder toezicht van de centrale bank (zoals banken) en geldmarktfondsen.
note: Vorige definitie: Subsector van de institutionele sector financiële instellingen. Deze subsector omvat:- De Nederlandsche Bank (DNB); - Geldscheppende instellingen die onder toezicht van DNB staan, zoals algemene banken, spaarbanken, effectenkredietinstellingen en zelfs
version info: 2
broader: Diensten
source: sector-monetaire-financiele-instellingen
modified: 2023-03-29T15:52:14Z
created: 2016-03-23T09:07:51Z
history note: De definitie is aangepast
related: Institutionele sector
related: Financiële instellingen

Begrippen CBS
type: ConceptScheme
preferred label: Concepts Statistics Netherlands @en

CBS begrip
label: CBS concept @en