Onderwijs
type: Concept
narrower: Leerweg ondersteunend onderwijs

Speciaal voortgezet onderwijs
type: Concept
related: Leerweg ondersteunend onderwijs
type: CBS begrip
preferred label: Special secondary education @en

Voortgezet onderwijs
type: Concept
related: Leerweg ondersteunend onderwijs
type: CBS begrip
preferred label: Secondary education (VO) @en

Leerweg ondersteunend onderwijs
type: Concept
type: CBS begrip
in scheme: Begrippen CBS
preferred label: Learning support department @en
alternative label: Lwoo
definition: Onderwijs bestemd voor vmbo-leerlingen met achterstanden of gedrags- en motivatieproblemen, die met extra begeleiding wel een diploma kunnen behalen. Hierin kunnen dezelfde vier leerwegen worden gevolgd en dezelfde diploma's worden gehaald als in het normale vmbo-onderwijs: de theoretische leerweg, de gemengde leerweg, de kaderberoepsgerichte leerweg en de basisberoepsgerichte leerweg.
definition: Education for pupils in lower secondary prevocational training (vmbo) who require remedial teaching or support in dealing with their behavioural or motivational problems to graduate. Students can study the same four tracks and graduate with the same diplo @en
version info: 1
broader: Onderwijs
scope note: Het lwoo heette tot en met schooljaar 1991/'92 individueel beroepsonderwijs (ibo). Vanaf schooljaar 1992/'93 tot en met schooljaar 1997/'98 heette het individueel voorbereidend beroepsonderwijs (ivbo). De theoretische leerweg is te beschouwen als de opvolger van de mavo en geeft toegang tot de middenkaderopleiding, niveau 4 van de kwalificatiestructuur van het mbo. Het is na diplomering tevens mogelijk door te stromen naar het vierde leerjaar havo. De gemengde leerweg is te beschouwen als een tussenvorm van de theoretische leerweg en de beroepsgerichte leerwegen, heeft hetzelfde niveau als de theoretische leerweg, maar heeft ook een beroepsgericht vak. De gemengde leerweg geeft toegang tot de middenkaderopleiding, niveau 4 van de kwalificatiestructuur van het mbo. De kaderberoepsgerichte leerweg is te beschouwen als de opvolger van de hoogste niveaus van het vbo en is de minimale vooropleiding voor de vakopleiding en de middenkaderopleiding, resp. op niveau 3 en 4 van de kwalificatiestructuur van het mbo. De basisberoepsgerichte leerweg is te beschouwen als de opvolger van de laagste niveaus van het vbo en is bedoeld als vooropleiding voor de basisberoepsopleiding, niveau 2 van de kwalificatiestructuur van het mbo.
source: leerweg-ondersteunend-onderwijs--lwoo--
modified: 2022-02-23T15:54:13Z
created: 2016-03-23T09:08:39Z
related: Speciaal voortgezet onderwijs
related: Voortgezet onderwijs

Begrippen CBS
type: ConceptScheme
preferred label: Concepts Statistics Netherlands @en

CBS begrip
label: CBS concept @en