Macro-economie
type: Concept
narrower: Multi-factorproductiviteit

Multi-factorproductiviteit
type: Concept
type: CBS begrip
in scheme: Begrippen CBS
alternative label: MFP
definition: De verhouding tussen de volumemaatstaf van de output en de optelsom van het volume van alle productiefactoren
version info: 1
broader: Macro-economie
scope note: De multi-factorproductiviteit geeft aan hoeveel een bedrijf, bedrijfstak of economie heeft geproduceerd per volume-eenheid van alle productiefactoren samen. Het is daarom een maatstaf voor de economische prestatie. In het geval de toegevoegde waarde als output wordt aangemerkt, bestaan de productiefactoren uit kapitaal en arbeid. In het geval de bruto-productie als output wordt aangemerkt, bestaan de productiefactoren uit kapitaal, arbeid en intermediair verbruik.
created: 2023-03-29T09:17:24

CBS begrip
label: CBS concept @en

Begrippen CBS
type: ConceptScheme
preferred label: Concepts Statistics Netherlands @en