Macro-economie
type: Concept
narrower: Schuld private sector

Schuld private sector
type: Concept
type: CBS begrip
in scheme: Begrippen CBS
definition: De schulden van niet-financiële vennootschappen, huishoudens en instellingen zonder winstoogmerk ten behoeve van huishoudens. Tot de schulden worden leningen en schuldbewijzen aan de passivazijde van de balans gerekend. De schulden zijn geconsolideerd: dit betekent dat schulden binnen dezelfde sector niet worden meegerekend.
version info: 1
broader: Macro-economie
created: 2023-03-29T09:17:24

CBS begrip
label: CBS concept @en

Begrippen CBS
type: ConceptScheme
preferred label: Concepts Statistics Netherlands @en