Bevolking
type: Concept
narrower: Saldo nationaliteitswijzigingen

Saldo nationaliteitswijzigingen
type: Concept
type: CBS begrip
in scheme: Begrippen CBS
preferred label: Balance of changes in nationality @en
definition: People living in the Netherlands who have received the Dutch nationality other than by birth minus the people living in the Netherlands who have lost the Dutch nationality other than by death. @en
definition: Het aantal inwoners van Nederland dat de Nederlandse nationaliteit heeft gekregen anders dan door geboorte min het aantal inwoners van Nederland dat de Nederlandse nationaliteit heeft verloren anders dan door overlijden.
version info: 1
broader: Bevolking
source: saldo-nationaliteitswijzigingen
modified: 2022-02-23T15:55:18Z
created: 2016-03-23T09:06:54Z

CBS begrip
label: CBS concept @en

Begrippen CBS
type: ConceptScheme
preferred label: Concepts Statistics Netherlands @en