Bevolking
type: Concept
narrower: Centraal persoonsregister

Centraal persoonsregister
type: Concept
type: CBS begrip
in scheme: Begrippen CBS
preferred label: Central population register @en
alternative label: CPR
definition: Register waarin een beperkt aantal inwoners van Nederland was ingeschreven. Het betrof personen die behoorden tot de bevolking van Nederland, maar aan wie geen vaste woongemeente kon worden toegewezen.
definition: Register that used to include a limited number of people residing in the Netherlands who belonged to the de jure population of the Netherlands but who did not have a fixed municipality of residence. @en
version info: 1
broader: Bevolking
scope note: Het centraal persoonsregister werd bijgehouden door de toenmalige Rijksinspectie van de bevolkingsregisters. Sinds 1 oktober 1994 zijn deze personen ingeschreven in het bevolkingsregister van de gemeente 's-Gravenhage.
source: centraal-persoonsregister--cpr--
modified: 2022-02-23T15:53:02Z
created: 2016-03-23T09:11:00Z

CBS begrip
label: CBS concept @en

Begrippen CBS
type: ConceptScheme
preferred label: Concepts Statistics Netherlands @en