Veiligheid en recht
type: Concept
narrower: Voorlopige hechtenis

Celbestemming
type: Concept
related: Voorlopige hechtenis
type: CBS begrip
preferred label: Use of cells @en

Verblijfstitel (of status) gedetineerden
type: Concept
related: Voorlopige hechtenis
type: CBS begrip
preferred label: Status of detainees @en

Schadevergoeding aan ex-verdachten
type: Concept
related: Voorlopige hechtenis
type: CBS begrip

Voorlopige hechtenis
type: Concept
type: CBS begrip
in scheme: Begrippen CBS
preferred label: Detention on remand @en
definition: Vrijheidsbeneming in een huis van bewaring voorafgaand aan behandeling ter terechtzitting, in het algemeen toegepast bij verdenking van een ernstig misdrijf (misdrijf waarop een gevangenisstraf van vier jaren of meer is gesteld), op grond van ernstig vluchtgevaar en/of een gewichtige reden van maatschappelijke veiligheid, bij voorbeeld vrees voor herhaling.
definition: Detention in a detention centre before the court hearings start. This is generally applied to suspects of serious crimes, punishable by at least four years in jail, or when there is a security risk or risk of re-offending. @en
version info: 1
broader: Veiligheid en recht
source: voorlopige-hechtenis
modified: 2022-02-23T15:56:15Z
created: 2016-03-23T09:08:32Z
related: Celbestemming
related: Verblijfstitel (of status) gedetineerden
related: Schadevergoeding aan ex-verdachten

Begrippen CBS
type: ConceptScheme
preferred label: Concepts Statistics Netherlands @en

CBS begrip
label: CBS concept @en