Bevolking
type: Concept
narrower: Remigratie

Reïmmigratie
type: Concept
related: Remigratie
type: CBS begrip

Reëmigratie
type: Concept
related: Remigratie
type: CBS begrip

Remigratie
type: Concept
type: CBS begrip
in scheme: Begrippen CBS
preferred label: Remigration @en
definition: Gemeenschappelijke term voor reëmigratie en reïmmigratie.
definition: Term for re-emigration and re-immigration. Re-emigration is when people coming from abroad and residing in the Netherlands take up residence abroad again.Re-immigration is when people who left the Netherlands for another country return to the Netherlands @en
version info: 1
broader: Bevolking
source: remigratie
modified: 2022-02-23T15:55:13Z
created: 2016-03-23T09:05:28Z
related: Reïmmigratie
related: Reëmigratie

Begrippen CBS
type: ConceptScheme
preferred label: Concepts Statistics Netherlands @en

CBS begrip
label: CBS concept @en