Bevolking
type: Concept
narrower: Saldo correcties (bevolking)

Saldo correcties (bevolking)
type: Concept
type: CBS begrip
in scheme: Begrippen CBS
preferred label: Balance of corrections (population) @en
definition: Saldo administratieve correcties plus overige correcties.
definition: The total balance of administrative and other corrections. @en
version info: 1
broader: Bevolking
source: saldo-correcties--bevolking--
modified: 2022-02-23T15:55:17Z
created: 2016-03-23T09:09:28Z

CBS begrip
label: CBS concept @en

Begrippen CBS
type: ConceptScheme
preferred label: Concepts Statistics Netherlands @en