Zorg en gezondheid
type: Concept
narrower: Subjectief welzijn

Subjectief welzijn
type: Concept
type: CBS begrip
in scheme: Begrippen CBS
preferred label: Subjective well-being @en
definition: De mate van tevredenheid met de financiële en maatschappelijke positie, de woonsituatie, de vrijetijdsbesteding, vrienden en kennissen, de maatschappij en het huwelijk en gezin.
definition: The degree of satisfaction one feels about one’s financial and social position, housing situation, leisure, friends, society, marriage and family. @en
version info: 1
broader: Zorg en gezondheid
source: subjectief-welzijn
modified: 2022-02-23T15:55:40Z
created: 2016-03-23T09:05:43Z

CBS begrip
label: CBS concept @en

Begrippen CBS
type: ConceptScheme
preferred label: Concepts Statistics Netherlands @en