Verkeer en vervoer
type: Concept
narrower: Bromfiets

Bromfiets
type: Concept
type: CBS begrip
in scheme: Begrippen CBS
preferred label: Moped @en
definition: Voertuig met een door de constructie bepaalde maximumsnelheid van niet meer dan 45 km/uur, uitgerust met een verbrandingsmotor met een cilinderinhoud van niet meer dan 50 cm³ (volgens de Nederlandse wet) of een elektromotor met een vermogen van niet meer dan 4 kW.
definition: Vehicle with a maximum speed of not more than 45 km/h, equipped with an internal combustion engine, with a cylinder capacity of not more than 50 cubic centimetres (according to the Dutch law) or an electric motor with a power not exceeding 4 KW. @en
version info: 1
broader: Verkeer en vervoer
scope note: Het betreft voertuigen in scooter- dan wel brommeruitvoering. De scooter heeft kleine, brede wielen; de voeten worden tussen stuur en zadel naast elkaar geplaatst. Gehandicapten-voertuigen vallen hier nt onder.
source: bromfiets
modified: 2022-02-23T15:52:54Z
created: 2016-03-23T09:19:41Z

CBS begrip
label: CBS concept @en

Begrippen CBS
type: ConceptScheme
preferred label: Concepts Statistics Netherlands @en