Arbeid en sociale zekerheid
type: Concept
narrower: CAO-sector overheid

CAO-sector
type: Concept
related: CAO-sector overheid
type: CBS begrip
preferred label: Collective labour agreement sector (CAO sector) @en

Ambtenaar
type: Concept
related: CAO-sector overheid
type: CBS begrip
preferred label: Civil servant @en

CAO-sector overheid
type: Concept
type: CBS begrip
in scheme: Begrippen CBS
preferred label: Collective labour agreement sector government @en
definition: CAO-sector die alle publiekrechtelijke bedrijven omvat, zoals rijksoverheid, provincies, gemeenten, waterschappen en het openbaar onderwijs. Daarnaast behoren de politie, het regulier bijzonder onderwijs en de academische ziekenhuizen tot de overheid.
definition: The collective labour agreement (CAO in Dutch) sector government includes all public enterprises such as general government, municipalities, water boards and public education. Also included are the police, regular special education and academic hospitals. @en
version info: 1
broader: Arbeid en sociale zekerheid
scope note: De CAO-sector overheid wordt verder onderverdeeld in een aantal subsectoren.
source: cao-sector-overheid
modified: 2022-02-23T15:53:01Z
created: 2016-03-23T09:05:13Z
related: CAO-sector
related: Ambtenaar

Begrippen CBS
type: ConceptScheme
preferred label: Concepts Statistics Netherlands @en

CBS begrip
label: CBS concept @en