Bevolking
type: Concept
narrower: Vestigingsregister (bevolking)

Vestigingsregister (bevolking)
type: Concept
type: CBS begrip
in scheme: Begrippen CBS
preferred label: Register of new residencies @en
definition: Voorziening binnen de gemeentelijke bevolkingsregisters om dubbele inschrijving van personen te voorkomen.
definition: A provision in the municipal population register to prevent double entries. @en
version info: 1
broader: Bevolking
scope note: Een gemeente mag voor een immigrant pas een persoonslijst aanleggen nadat bij het Vestigingsregister is nagegaan dat van deze persoon nog geen persoonslijst bestaat. Bij opschorting van de bijhouding van een persoonslijst ten gevolge van emigratie of administratieve afvoering stelt de gemeente het Vestigingsregister hiervan in kennis. Een dergelijke persoonslijst blijft bij de gemeente tot wiens bevolking de emigrant het laatst behoorde. Bij hervestiging in Nederland wordt de opschorting van de bijhouding van de persoonslijst ongedaan gemaakt.
source: vestigingsregister--bevolking--
modified: 2022-02-23T15:56:09Z
created: 2016-03-23T09:06:01Z

CBS begrip
label: CBS concept @en

Begrippen CBS
type: ConceptScheme
preferred label: Concepts Statistics Netherlands @en