Arbeid en sociale zekerheid
type: Concept
narrower: AOW-inkomen

AOW-inkomen
type: Concept
type: CBS begrip
in scheme: Begrippen CBS
preferred label: Income under the General Old Age Pension Act (AOW). @en
definition: Bruto-uitkering die wordt ontvangen op grond van de Algemene Ouderdomswet.
definition: Gross benefits received under the General Old Age Pension Act (AOW). @en
version info: 1
broader: Arbeid en sociale zekerheid
source: aow-inkomen
modified: 2022-02-23T15:52:23Z
created: 2016-03-23T09:03:38Z

CBS begrip
label: CBS concept @en

Begrippen CBS
type: ConceptScheme
preferred label: Concepts Statistics Netherlands @en