Veiligheid en recht
type: Concept
narrower: Rechtsvorm van bedrijven

Eenmanszaak
type: Concept
related: Rechtsvorm van bedrijven
type: CBS begrip
preferred label: Sole proprietorship @en

Juridische eenheid
type: Concept
related: Rechtsvorm van bedrijven
type: CBS begrip
preferred label: Legal entity @en

Sector vennootschappen
type: Concept
related: Rechtsvorm van bedrijven
type: CBS begrip
preferred label: Sector corporations @en

Verzekeringsinstellingen en pensioenfondsen
type: Concept
related: Rechtsvorm van bedrijven
type: CBS begrip
preferred label: Insurance corporations @en

Rechtsvorm van bedrijven
type: Concept
type: CBS begrip
in scheme: Begrippen CBS
preferred label: Legal form @en
definition: Vorm van juridische eenheden die in het recht bekend is.
definition: A legal unit recognised in Dutch law. @en
version info: 1
broader: Veiligheid en recht
scope note: De navolgende rechtsvormen kunnen onder meer worden onderscheiden: - Nederlandse rechtsvormen zonder rechtspersoonlijkheid: eenmanszaak, vennootschap onder firma, commanditaire vennootschap, maatschap; - Nederlandse rechtsvormen met rechtspersoonlijkheid: besloten vennootschap, naamloze vennootschap, vereniging, stichting, coöperatie, onderlinge waarborgmaatschappij; - Europese rechtsvormen: Europees economisch samenwerkingsverband, Europese vennootschap, Europese coöperatieve vennootschap; - Buitenlandse rechtspersonen. Zie de alfabetische begrippenlijst voor definities van deze rechtsvormen. Formeel is de rechtsvorm een kenmerk van een juridische eenheid en niet van een bedrijf. De statistische eenheid 'bedrijf' kan bestaan uit een of meer juridische eenheden (natuurlijke personen en/of niet-natuurlijke personen). Als een bedrijf uit meer dan één juridische eenheid bestaat, dan heeft het in principe geen eigen rechtsvorm. In de CBS-tabellen worden dergelijke bedrijven opgenomen onder de rechtsvorm van die juridische eenheid die als kern van de combinatie kan worden beschouwd.
source: rechtsvorm-van-bedrijven
modified: 2022-02-23T15:55:10Z
created: 2016-03-23T09:07:27Z
related: Eenmanszaak
related: Juridische eenheid
related: Sector vennootschappen
related: Verzekeringsinstellingen en pensioenfondsen

Begrippen CBS
type: ConceptScheme
preferred label: Concepts Statistics Netherlands @en

CBS begrip
label: CBS concept @en