Bouwen en wonen
type: Concept
narrower: Bouwvergunning

Bouwvergunning
type: Concept
type: CBS begrip
in scheme: Begrippen CBS
preferred label: Building permission @en
definition: Vergunning, ingevolge de woningwet nodig voor het bouwen of verbouwen van een gebouw.
definition: Permission granted to build or renovate a building as required by the law on housing. @en
version info: 1
broader: Bouwen en wonen
scope note: In de Woningwet is vastgelegd voor welke bouwwerken (ook 'niet voor bewoning bestemde gebouwen' of 'bouwwerken geen gebouw zijnde' zoals bruggen etc) een vergunning is vereist. De vergunning wordt afgegeven door de gemeente, die eerst toetst of het bouwplan voldoet aan: het bestemmingsplan; het Bouwbesluit; de lokale Bouwverordening, en de redelijke eisen van welstand. In Nederland is de bouwvergunning per 1 oktober 2010 vervangen door een meeromvattende omgevingsvergunning. Een vergunning kan voor één of meer gebouwen tegelijk afgegeven worden.
source: bouwvergunning
modified: 2022-02-23T15:52:53Z
created: 2016-03-23T09:07:49Z

CBS begrip
label: CBS concept @en

Begrippen CBS
type: ConceptScheme
preferred label: Concepts Statistics Netherlands @en