Industrie en energie
type: Concept
narrower: Niet-energetisch finaal gebruik

Niet-energetisch finaal gebruik
type: Concept
type: CBS begrip
in scheme: Begrippen CBS
preferred label: Final consumption of non-energetic purposes @en
definition: Gebruik van een energiedrager voor het maken van een product dat geen energiedrager is, waarbij de voor het productieproces gebruikte energie in het product aanwezig blijft.
definition: Final use of energy other than as a source of power or heat. @en
version info: 1
broader: Industrie en energie
scope note: Voorbeelden zijn het gebruik van olie als grondstof voor plastic of aardgas voor kunstmest. Dit is exclusief verbruik voor energieomzetting.
source: niet-energetisch-finaal-gebruik
modified: 2022-02-23T15:54:32Z
created: 2016-03-23T09:09:40Z

CBS begrip
label: CBS concept @en

Begrippen CBS
type: ConceptScheme
preferred label: Concepts Statistics Netherlands @en