Verkeer en vervoer
type: Concept
narrower: Soort vervoermiddel (vakantie)

Soort vervoermiddel (vakantie)
type: Concept
type: CBS begrip
in scheme: Begrippen CBS
definition: Soort voertuig waarmee op de heenreis van de vakantie de grootste afstand werd afgelegd.
version info: 1
broader: Verkeer en vervoer
scope note: Bij de indeling naar vervoermiddelen zijn in de categorie 'boot' zeilboten, motorjachten en schepen voor zee- of riviercruises ondergebracht. Veerboten en ferry's zijn als een afzonderlijke categorie vermeld of bij de ‘overige vervoermiddelen’ ondergebracht.
source: soort-vervoermiddel--vakantie--
modified: 2022-02-23T15:55:29Z
created: 2016-03-23T09:12:37Z

CBS begrip
label: CBS concept @en

Begrippen CBS
type: ConceptScheme
preferred label: Concepts Statistics Netherlands @en