Bevolking
type: Concept
narrower: Naturalisatie

Naturalisatie
type: Concept
type: CBS begrip
in scheme: Begrippen CBS
preferred label: Naturalisation @en
definition: Verkrijging van het Nederlanderschap door verlening (zelfstandige naturalisatie of medenaturalisatie).
definition: Obtaining Dutch citizenship by granting independent or co-naturalisation @en
version info: 1
broader: Bevolking
source: naturalisatie
modified: 2022-02-23T15:54:29Z
created: 2016-03-23T09:04:59Z

CBS begrip
label: CBS concept @en

Begrippen CBS
type: ConceptScheme
preferred label: Concepts Statistics Netherlands @en