Bevolking
type: Concept
narrower: Oversterfte

Oversterfte
type: Concept
type: CBS begrip
in scheme: Begrippen CBS
preferred label: Excess mortality @en
definition: Temporary and exceptional rise in the number of deceased that is coinciding with a causal event like an epedemic. There is an excess mortality when the he actual number of deaths is higher than the expected number in the same period. @en
definition: Oversterfte is een tijdelijke, bijzondere stijging van het aantal overledenen die samenvalt met een bijzondere gebeurtenis, zoals een griepepidemie, hittegolf of corona-epidemie. Het CBS spreekt van oversterfte wanneer het waargenomen aantal overledenen hoger is dan het verwachte aantal overledenen in dezelfde periode.
version info: 1
broader: Bevolking
source: oversterfte
modified: 2022-02-23T15:54:53Z
created: 2016-03-23T09:19:38Z

CBS begrip
label: CBS concept @en

Begrippen CBS
type: ConceptScheme
preferred label: Concepts Statistics Netherlands @en