Veiligheid en recht
type: Concept
narrower: Vreemdelingenrecht

Vreemdelingenrecht
type: Concept
type: CBS begrip
in scheme: Begrippen CBS
definition: Onderdeel van het bestuursrecht dat betrekking heeft op de toelating, het verblijf en de verwijdering van niet-Nederlanders.
version info: 1
broader: Veiligheid en recht
scope note: Het vreemdelingenrecht bestaat uit twee peilers: het reguliere vreemdelingenrecht en het asielrecht.
source: vreemdelingenrecht
modified: 2022-02-23T15:56:17Z
created: 2016-03-23T09:19:31Z

CBS begrip
label: CBS concept @en

Begrippen CBS
type: ConceptScheme
preferred label: Concepts Statistics Netherlands @en