Bedrijven
type: Concept
narrower: Saldo voorzieningen

Saldo voorzieningen
type: Concept
type: CBS begrip
in scheme: Begrippen CBS
preferred label: Balance of provisions @en
definition: The additions to provisions minus released provisions such as run-up and reconstitution funds, maintenance reserves, guarantee provisions, etc. @en
definition: Het verschil tussen toevoegingen en onttrekkingen (incl. vrijval) aan voorzieningen. Het betreft de toevoegingen en onttrekkingen aan interne voorzieningsfondsen, zoals aanloop- en reorganisatiefondsen, onderhoudsfondsen.
version info: 1
broader: Bedrijven
source: saldo-voorzieningen
modified: 2022-02-23T15:55:18Z
created: 2016-03-23T09:19:13Z

CBS begrip
label: CBS concept @en

Begrippen CBS
type: ConceptScheme
preferred label: Concepts Statistics Netherlands @en