Arbeid en sociale zekerheid
type: Concept
narrower: Ziekteverzuim overheid

Ziekteverzuim overheid
type: Concept
type: CBS begrip
in scheme: Begrippen CBS
preferred label: Sick leave (government) @en
definition: Het aantal verzuimde kalenderdagen (inclusief weekends) gedeeld door de personeelsomvang vermenigvuldigd met het aantal kalenderdagen.
definition: Sick leave refers to sick leave including leave of more than one year and excluding pregnancy and maternity leave for public sector employees: central government, provinces, municipalities, water boards, defence, police, education and the judiciary. @en
version info: 1
broader: Arbeid en sociale zekerheid
scope note: Bij parttimers wordt het aantal verzuimde kalenderdagen vermenigvuldigd met de deeltijdfactor. De personeelsomvang wordt uitgedrukt in voltijdsequivalenten (fte). Het ziekteverzuimpercentage heeft betrekking op de lopende gevallen in de verslagperiode.
source: ziekteverzuim-overheid
modified: 2022-02-23T15:56:34Z
created: 2016-03-23T09:08:16Z

CBS begrip
label: CBS concept @en

Begrippen CBS
type: ConceptScheme
preferred label: Concepts Statistics Netherlands @en