Veiligheid en recht
type: Concept
narrower: Extramurale detentie

Penitentiaire inrichting
type: Concept
related: Extramurale detentie
type: CBS begrip
preferred label: Penitentiary institution @en

Gedetineerde
type: Concept
related: Extramurale detentie
type: CBS begrip
preferred label: Detainee @en

Elektronisch Detentiehuis
type: Concept
related: Extramurale detentie
type: CBS begrip

Extramurale detentie
type: Concept
type: CBS begrip
in scheme: Begrippen CBS
definition: Vorm van vrijheidsbeperking waarbij gevangenen buiten de muren van een penitentiaire inrichting verblijven.
version info: 1
broader: Veiligheid en recht
scope note: Onder extramurale detentie vallen de extramurale penitentiaire programma's (met en zonder elektronisch toezicht), elektronische toezicht en elektronische detentie. Het elektronisch detentiehuis (EDH) valt niet onder extramurale detentie omdat hier de gedetineerden in een penitentiaire inrichting verblijven.
source: extramurale-detentie
modified: 2022-02-23T15:53:28Z
created: 2016-03-23T09:17:35Z
related: Penitentiaire inrichting
related: Gedetineerde
related: Elektronisch Detentiehuis

Begrippen CBS
type: ConceptScheme
preferred label: Concepts Statistics Netherlands @en

CBS begrip
label: CBS concept @en