Vrije tijd en cultuur
type: Concept
narrower: Instelling voor kunstzinnige vorming

Instelling voor kunstzinnige vorming
type: Concept
type: CBS begrip
in scheme: Begrippen CBS
preferred label: Institution for education in the arts @en
definition: Een juridisch zelfstandig rechtspersoon met een eigen begroting en zonder winstoogmerk met activiteiten op het gebied van kunstzinnige vorming.
definition: A non-profit legal entity with its own budget active in arts and education. @en
version info: 1
broader: Vrije tijd en cultuur
source: instelling-voor-kunstzinnige-vorming
modified: 2022-02-23T15:53:58Z
created: 2016-03-23T09:11:38Z

CBS begrip
label: CBS concept @en

Begrippen CBS
type: ConceptScheme
preferred label: Concepts Statistics Netherlands @en