Macro-economie
type: Concept
narrower: Economische groei

Economische groei
type: Concept
type: CBS begrip
in scheme: Begrippen CBS
preferred label: Economic growth @en
definition: The volume growth of the gross domestic product (GDP) usually at market prices. @en
definition: De volumegroei van het bruto binnenlands product tegen marktprijzen.
note: Vorige definitie: De volumegroei van het bruto binnenlands product (meestal tegen marktprijzen).
version info: 2
broader: Macro-economie
source: economische-groei
modified: 2023-03-29T15:52:14Z
created: 2016-03-23T09:04:16Z
history note: De definitie is aangepast

CBS begrip
label: CBS concept @en

Begrippen CBS
type: ConceptScheme
preferred label: Concepts Statistics Netherlands @en