Verkeer en vervoer
type: Concept
narrower: Sleepvaart

Sleepvaart
type: Concept
type: CBS begrip
in scheme: Begrippen CBS
preferred label: Towage @en
definition: Vaart waarbij een of meer sleepschepen of bakken door een slepend schip worden voortgetrokken.
definition: Shipping where one or more towing barges or dumb barges are towed by a tug boat. @en
version info: 1
broader: Verkeer en vervoer
source: sleepvaart
modified: 2022-02-23T15:55:27Z
created: 2016-03-23T09:12:20Z

CBS begrip
label: CBS concept @en

Begrippen CBS
type: ConceptScheme
preferred label: Concepts Statistics Netherlands @en