Arbeid en sociale zekerheid
type: Concept
narrower: Wet arbeidsongeschiktheidsvoorziening jonggehandicapten (Wajong)

Wet arbeidsongeschiktheidsvoorziening jonggehandicapten (Wajong)
type: Concept
type: CBS begrip
in scheme: Begrippen CBS
preferred label: Disability Insurance Young Disabled Persons Act (Wajong) @en
definition: Wettelijke voorziening in de financiële gevolgen van langdurige arbeidsongeschiktheid van mensen die geen aanspraak kunnen maken op de WAO omdat er geen arbeidsverleden is opgebouwd.
definition: Provision for the financial consequences of long-term disablement for people who cannot claim WAO benefits because they have no employment record. @en
version info: 1
broader: Arbeid en sociale zekerheid
scope note: Dit zijn mensen die arbeidsongeschikt zijn op de dag dat zij 17 jaar worden of na hun 17e jaar arbeidsongeschikt worden én een opleiding/studie volgen.
source: wet-arbeidsongeschiktheidsvoorziening-jonggehandicapten--wajong--
modified: 2022-02-23T15:56:26Z
created: 2016-03-23T09:10:00Z

CBS begrip
label: CBS concept @en

Begrippen CBS
type: ConceptScheme
preferred label: Concepts Statistics Netherlands @en