Bouwen en wonen
narrower: Woning (bouwtechnisch)
type: Concept

Woning (bouwtechnisch)
type: Concept
type: CBS begrip
in scheme: Begrippen CBS
preferred label: Dwelling (construction perspective) @en
definition: Het kleinste binnen één of meer panden gelegen en voor woondoeleinden bestemde (gebruiksdoel is woonfunctie) verblijfsobject, ontsloten via een eigen toegang vanaf de openbare weg, een erf of een gedeelde verkeersruimte, wordt als woning aangemerkt.
definition: A residential building that - from a construction-technical point of view - is intended for permanent residence by one private household. @en
version info: 1
broader: Bouwen en wonen
scope note: Om als woning geclassificeerd te worden moet het tot bewoning bestemde gebouw aan vier criteria voldoen: Criterium 1: Het tot bewoning bestemde verblijfsobject dient zodanig te zijn gebouwd of verbouwd dat het gedurende het hele jaar voor particuliere bewoning door één huishouden geschikt is. Criterium 2: Het tot bewoning bestemde verblijfsobject dient te zijn voorzien van een eigen toegangsdeur die hetzij direct vanaf de openbare weg, hetzij via een gemeenschappelijke ruimte (zoals portiek, galerij, trappenhuis, corridor) toegang biedt tot de woonruimte. Criterium 3: Het tot bewoning bestemde verblijfsobject dient ten minste 14 m2 aan verblijfsruimte te bevatten. Criterium 4: Het tot bewoning bestemde verblijfsobject dient te beschikken over een toilet en over een keukeninrichting die is bestemd voor de bereiding van complete maaltijden.
source: woning--bouwtechnisch--
modified: 2022-02-23T15:56:30Z
created: 2016-03-23T09:06:22Z

CBS begrip
label: CBS concept @en

Begrippen CBS
type: ConceptScheme
preferred label: Concepts Statistics Netherlands @en