Overheid en politiek
narrower: Collectieve voorziening
type: Concept

Collectieve voorziening
type: Concept
type: CBS begrip
in scheme: Begrippen CBS
preferred label: Collective provision @en
definition: Door de overheid geregelde vorm van dienstverlening aan de bevolking, die gratis of tegen een vergoeding beneden de kostprijs wordt geleverd en die wordt gekenmerkt door het feit dat zij hoofdzakelijk uit de algemene middelen (belastingen e.d.) wordt gefinancierd.
definition: Service provided to the population, laid down by the government. It is provided for free or for a fee below cost price and is characterised by the fact that it is financed mainly from the public funds (taxes etc.). @en
version info: 1
broader: Overheid en politiek
source: collectieve-voorziening
modified: 2022-02-23T15:53:04Z
created: 2016-03-23T09:04:07Z

CBS begrip
label: CBS concept @en

Begrippen CBS
type: ConceptScheme
preferred label: Concepts Statistics Netherlands @en