Verkeer en vervoer
narrower: Verkeersdeelname
type: Concept

Verkeersdeelname
type: Concept
type: CBS begrip
in scheme: Begrippen CBS
definition: Het aandeel personen dat zich op een bepaalde dag op de openbare weg begeeft.
version info: 1
broader: Verkeer en vervoer
scope note: Dit kan als voetganger of als gebruiker (bestuurder of passagier) van een vervoermiddel.
source: verkeersdeelname
modified: 2022-02-23T15:56:01Z
created: 2016-03-23T09:19:33Z

CBS begrip
label: CBS concept @en

Begrippen CBS
type: ConceptScheme
preferred label: Concepts Statistics Netherlands @en