Arbeid en sociale zekerheid
narrower: Arbeidsvoorwaarden
type: Concept

Arbeidsovereenkomst
related: Arbeidsvoorwaarden
type: Concept
type: CBS begrip
preferred label: Labour contract @en

Collectieve arbeidsovereenkomst
related: Arbeidsvoorwaarden
type: Concept
type: CBS begrip
preferred label: Collective labour agreement @en

Arbeidsvoorwaarden
type: Concept
type: CBS begrip
in scheme: Begrippen CBS
preferred label: Terms of employment @en
definition: Arbeidsvoorwaarden zijn de voorwaarden waarop u werkt. De meest bekende arbeidsvoorwaarden zijn arbeidsduur, salaris en vakantiedagen. Arbeidsvoorwaarden worden met uw werkgever afgesproken en vastgelegd in een arbeidsovereenkomst. Vaak zijn er ook arbeidsvoorwaarden vastgelegd in een cao. Bovendien staan in sommige wetten regels op het gebied van arbeidsvoorwaarden.
definition: All conditions agreed upon by employer and employee which are observed when they enter into a labour agreement, either on an individual or on a collective basis. These terms are regulated by law in a collective labour agreement. Certain entitlements and o @en
version info: 1
broader: Arbeid en sociale zekerheid
scope note: Er worden primaire, secundaire en tertiaire arbeidsvoorwaarden onderscheiden. Primaire arbeidsvoorwaarden hebben betrekking op primaire eisen waaraan bij de arbeid wettelijk moet worden voldaan, zoals loon en vakantie, en de hoofdverplichtingen van de werknemer. Secundaire arbeidsvoorwaarden worden gewoonlijk per CAO vastgesteld en hebben betrekking op zaken als pensioenen, functiewaarderingsstelsels, bijkomende beloningen van niet essentiële aard, en nadere detaillering van werktijden en vakantiedagen. Tertiaire arbeidsvoorwaarden gelden niet voor een gehele bedrijfstak en kunnen daarom ook moeilijk in een collectieve regeling worden neergelegd. Ze worden per onderneming, bijvoorbeeld in een reglement, vastgesteld. Niet tot de arbeidsvoorwaarden behoren emolumenten, d.w.z. ongeregeld bijkomend voordeel boven de aan de functie verbonden beloning.
source: arbeidsvoorwaarden
modified: 2022-02-23T15:52:27Z
created: 2016-03-23T09:03:46Z
related: Arbeidsovereenkomst
related: Collectieve arbeidsovereenkomst

CBS begrip
label: CBS concept @en

Begrippen CBS
type: ConceptScheme
preferred label: Concepts Statistics Netherlands @en