Arbeid en sociale zekerheid
narrower: Wet inkomensvoorziening oudere en gedeeltelijk arbeidsongeschikte werkloze werknemers (IOAW)
type: Concept

Wet inkomensvoorziening oudere en gedeeltelijk arbeidsongeschikte werkloze werknemers (IOAW)
type: Concept
type: CBS begrip
in scheme: Begrippen CBS
preferred label: Act on Income Provisions for Older and Partially Disabled Unemployed Persons (IOAW) @en
definition: De wet biedt een inkomensgarantie op het niveau van het sociaal minimum aan oudere en gedeeltelijk arbeidsongeschikte werkloze werknemers, van wie het recht op uitkering op grond van de Werkloosheidswet is geëindigd. De wet is in werking getreden met ingang van 1 januari 1987 en is ingrijpend gewijzigd met ingang van 1 januari 1996.
definition: The law provides older and partially disabled persons, whose claim to benefits under the Unemployment Benefits Act (WW) has ended, with a minimum guaranteed income. The law came into force on 1 January 1987 and was revised as per 1 January 1996. @en
version info: 1
broader: Arbeid en sociale zekerheid
source: wet-inkomensvoorziening-oudere-en-gedeeltelijk-arbeidsongeschikte-werkloze-werknemers--ioaw--
modified: 2022-02-23T15:56:26Z
created: 2016-03-23T09:06:17Z

CBS begrip
label: CBS concept @en

Begrippen CBS
type: ConceptScheme
preferred label: Concepts Statistics Netherlands @en