Bevolking
narrower: Verweduwende persoon
type: Concept

Verweduwende persoon
type: Concept
type: CBS begrip
in scheme: Begrippen CBS
definition: Persoon van wie het huwelijk in het referentiejaar is ontbonden door het overlijden van de partner.
version info: 1
broader: Bevolking
scope note: De persoon moet tijdens het overlijden van de partner in het bevolkingsregister van een Nederlandse gemeente staan ingeschreven.
source: verweduwende-persoon
modified: 2022-02-23T15:56:06Z
created: 2016-03-23T09:15:23Z

CBS begrip
label: CBS concept @en

Begrippen CBS
type: ConceptScheme
preferred label: Concepts Statistics Netherlands @en