Industrie en energie
narrower: Stoom
type: Concept

Stoom
type: Concept
type: CBS begrip
in scheme: Begrippen CBS
preferred label: Steam @en
definition: Water van 100 graden Celsius of warmer. Uitgedrukt als normaalstoom, dat is stoom met een druk van 1 bar en een temperatuur van 100 graden Celsius.
definition: Water of 100 or more degrees Celsius. Expressed as normal steam, that is steam with a pressure of 1 bar and a temperature of 100 degrees Celsius. @en
version info: 1
broader: Industrie en energie
source: stoom
modified: 2022-02-23T15:55:38Z
created: 2016-03-23T09:18:49Z

CBS begrip
label: CBS concept @en

Begrippen CBS
type: ConceptScheme
preferred label: Concepts Statistics Netherlands @en