Verkeer en vervoer
narrower: Nulvervoer
type: Concept

Nulvervoer
type: Concept
type: CBS begrip
in scheme: Begrippen CBS
definition: Hiervan is sprake indien de respondent op de enquêtedag geen verplaatsingen heeft gemaakt.
version info: 1
broader: Verkeer en vervoer
source: nulvervoer
modified: 2022-02-23T15:54:36Z
created: 2016-03-23T09:08:03Z

CBS begrip
label: CBS concept @en

Begrippen CBS
type: ConceptScheme
preferred label: Concepts Statistics Netherlands @en