Arbeid en sociale zekerheid
narrower: Wet Investeren in Jongeren
type: Concept

Wet Investeren in Jongeren
type: Concept
type: CBS begrip
in scheme: Begrippen CBS
definition: Wet die als doel heeft jongeren van 18 tot 27 jaar te begeleiden naar werk of scholing.
version info: 1
broader: Arbeid en sociale zekerheid
scope note: Gemeenten doen hen een aanbod, een werkleer-traject. De WIJ trad per 1 oktober 2009 in werking en kwam per 1 januari 2012 te vervallen, opgegaan in WWB.
source: wet-investeren-in-jongeren
modified: 2022-02-23T15:56:26Z
created: 2016-03-23T09:19:22Z

CBS begrip
label: CBS concept @en

Begrippen CBS
type: ConceptScheme
preferred label: Concepts Statistics Netherlands @en