Arbeid en sociale zekerheid
narrower: Spaarloon
type: Concept

Bedrijfsspaarregeling
related: Spaarloon
type: Concept
type: CBS begrip
preferred label: Employee savings scheme @en

Spaarloon
type: Concept
type: CBS begrip
in scheme: Begrippen CBS
preferred label: Save-as-you-earn deduction @en
definition: Het deel van het brutoloon dat de werkgever op grond van de spaarloonregeling op een spaarrekening van de werknemer stort.
definition: The part of the gross wages deposited in the employee’s account for the save-as-you-earn scheme. @en
version info: 1
broader: Arbeid en sociale zekerheid
scope note: Periodiek of eenmalig houdt de werkgever een bedrag in van het brutoloon dat gestort wordt op een aparte spaarloonrekening (of effectenrekening) van de werknemer. Elk jaar kent een maximaal spaarbedrag dat na vier jaar geblokkeerd te zijn, belastingvrij kan worden opgenomen. Tussentijds opnemen is (soms met aanvullende voorwaarden) mogelijk: - voor het voldoen van premies van bepaalde levensverzekeringen; - bij de aankoop van een eigen huis; - bij het opnemen van onbetaald verlof; - voor de start van een eigen onderneming; - voor studiekosten; - voor de financiering van kinderopvang (vanaf 1 januari 2005); - voor de kosten van de procedure Erkenning verworven competenties (EVC-procedure) (vanaf 1 januari 2007). De rente is vrij opneembaar tot een bepaald bedrag (belastingvrij) en wordt niet verrekend met de algemene belastingvrijstelling. In 2003 heeft een wetswijziging vervroegd deblokkeren van de spaarlooninleg uit 2000 en de premiespaarinleg uit 2000 en 2001 mogelijk gemaakt. In 2005 heeft een wetswijziging vervroegd deblokkeren van de spaarlooninleg uit 2002 tot en met 2004 mogelijk gemaakt vanaf 1 september 2005.
source: spaarloon
modified: 2022-02-23T15:55:30Z
created: 2016-03-23T09:05:36Z
related: Bedrijfsspaarregeling

CBS begrip
label: CBS concept @en

Begrippen CBS
type: ConceptScheme
preferred label: Concepts Statistics Netherlands @en