Arbeid en sociale zekerheid
narrower: Algemene nabestaandenwet
type: Concept

Algemene nabestaandenwet
type: Concept
type: CBS begrip
in scheme: Begrippen CBS
preferred label: General Survivors Pension Act (ANW) @en
alternative label: ANW
definition: Een algemene, de gehele bevolking omvattende, verplichte verzekering die nabestaanden van een verzekerde een inkomen garandeert.
definition: Provision against the financial consequences of death. In the Dutch social security system this is a social insurance. @en
version info: 1
broader: Arbeid en sociale zekerheid
scope note: Vanaf 1 juli 2013 kent de ANW twee soorten uitkeringen: de nabestaandenuitkering en de wezenuitkering. De halfwezenuitkering is per deze datum vervallen. In het Nederlandse sociale zekerheidsstelsel is dit een volksverzekering.
source: algemene-nabestaandenwet
modified: 2022-02-23T15:52:21Z
created: 2016-03-23T09:06:37Z

CBS begrip
label: CBS concept @en

Begrippen CBS
type: ConceptScheme
preferred label: Concepts Statistics Netherlands @en