Natuur en milieu
narrower: Begraafplaats
type: Concept

Classificatie Bodemgebruik
related: Begraafplaats
type: Concept
type: CBS begrip
preferred label: Land use, classification @en

Begraafplaats
type: Concept
type: CBS begrip
in scheme: Begrippen CBS
preferred label: Cemetery @en
definition: Terrein in gebruik voor begraven en cremeren.
definition: Area used to bury and cremate the dead. @en
version info: 1
broader: Natuur en milieu
scope note: Tot begraafplaats wordt gerekend: - terrein voor het begraven van mensen of dieren; - crematorium; - bijbehorende gebouwen, parken, tuinen, parkeerterreinen en bos- of heesterstroken.
source: begraafplaats
modified: 2022-02-23T15:52:37Z
created: 2016-03-23T09:07:33Z
related: Classificatie Bodemgebruik

CBS begrip
label: CBS concept @en

Begrippen CBS
type: ConceptScheme
preferred label: Concepts Statistics Netherlands @en