Arbeid en sociale zekerheid
narrower: Sociale lasten
type: Concept

Toegerekende sociale premies
related: Sociale lasten
type: Concept
type: CBS begrip
preferred label: Imputed social premiums @en

Sociale lasten
type: Concept
type: CBS begrip
in scheme: Begrippen CBS
preferred label: Social security contributions @en
definition: The contributions paid by employers to social security. These include imputed and actual social premiums and actual pension premiums. @en
definition: De werkgeversbijdragen in het kader van de sociale zekerheid. Deze omvatten de toegerekende en werkelijke sociale premies en de werkelijke pensioenpremies.
version info: 2
broader: Arbeid en sociale zekerheid
source: sociale-lasten
modified: 2023-03-29T15:52:14Z
created: 2016-03-23T09:05:34Z
related: Toegerekende sociale premies

CBS begrip
label: CBS concept @en

Begrippen CBS
type: ConceptScheme
preferred label: Concepts Statistics Netherlands @en