Veiligheid en recht
narrower: Discriminatie
type: Concept

Discriminatie
type: Concept
type: CBS begrip
in scheme: Begrippen CBS
preferred label: Discrimination @en
definition: Misdrijf tegen de openbare orde, omschreven in art. 137c t/m 137g Wetboek van Strafrecht. Belediging van een bevolkingsgroep en ongeoorloofd onderscheid maken bij de uitoefening van een beroep of ambt vallen hieronder.
version info: 1
broader: Veiligheid en recht
source: discriminatie
modified: 2022-02-23T15:53:15Z
created: 2016-03-23T09:17:15Z

CBS begrip
label: CBS concept @en

Begrippen CBS
type: ConceptScheme
preferred label: Concepts Statistics Netherlands @en