Veiligheid en recht
narrower: Dagvaarding
type: Concept

Burgerlijk recht
related: Dagvaarding
type: Concept
type: CBS begrip
preferred label: Civil law @en

Strafrecht
related: Dagvaarding
type: Concept
type: CBS begrip

Eindvonnis, burgerlijk recht
related: Dagvaarding
type: Concept
type: CBS begrip
preferred label: Final court judgement @en

Dagvaarding
type: Concept
type: CBS begrip
in scheme: Begrippen CBS
preferred label: Summons @en
definition: Officieel geschrift dat iemand oproept op een bepaalde tijd voor de rechter te verschijnen in verband met het beslechten van een geschil (burgerlijk recht), of de vervolging van een strafbaar feit (strafrecht).
definition: Official document (writ) summoning a person to appear in court to settle a conflict (civil procedure) or to go on trial on criminal charges (criminal procedure) @en
version info: 1
broader: Veiligheid en recht
source: dagvaarding
modified: 2022-02-23T15:53:10Z
created: 2016-03-23T09:04:11Z
related: Burgerlijk recht
related: Strafrecht
related: Eindvonnis, burgerlijk recht

CBS begrip
label: CBS concept @en

Begrippen CBS
type: ConceptScheme
preferred label: Concepts Statistics Netherlands @en