Zorg en gezondheid
narrower: Niet-voorgeschreven geneesmiddelen
type: Concept

Niet-voorgeschreven geneesmiddelen
type: Concept
type: CBS begrip
in scheme: Begrippen CBS
preferred label: Non-prescription medicine @en
definition: Geneesmiddelen die zonder recept verkregen kunnen worden.
definition: Medicine that can be bought over the counter without a doctor’s prescription. @en
version info: 1
broader: Zorg en gezondheid
scope note: Hiertoe behoren: pijn- en koortswerende middelen, zoals aspirine; middelen tegen hoest, verkoudheid, griep, keelpijn enz.; versterkende middelen, zoals vitaminen, mineralen en tonica; laxeermiddelen; geneesmiddelen tegen maag- en darmklachten; spijsverteringsmiddelen; slaap- en kalmeringsmiddelen; middelen tegen de zenuwen; medicijnen voor de huid; geneesmiddelen tegen reuma, gewrichtspijnen; homeopathische middelen.
source: niet-voorgeschreven-geneesmiddelen
modified: 2022-02-23T15:54:34Z
created: 2016-03-23T09:05:02Z

CBS begrip
label: CBS concept @en

Begrippen CBS
type: ConceptScheme
preferred label: Concepts Statistics Netherlands @en