Zorg en gezondheid
narrower: Categoraal ziekenhuis
type: Concept

Categoraal ziekenhuis
type: Concept
type: CBS begrip
in scheme: Begrippen CBS
preferred label: Specialised hospital @en
definition: Medisch-specialistische centrum voor behandeling en verpleging met overnachting, gericht op een specifieke bevolkingsgroep en/of specifieke fysieke ziekten.
definition: An institution in which medical specialist help and nursing care is on offer for a particular illness or affliction, or to people in a certain group. @en
version info: 1
broader: Zorg en gezondheid
scope note: Enkele voorbeelden zijn: astmaklinieken, epilepsieklinieken, kankerklinieken, oogziekenhuizen, orthopedische inrichtingen, revalidatie-instellingen, sanatoria.
source: categoraal-ziekenhuis
modified: 2022-02-23T15:53:01Z
created: 2016-03-23T09:10:39Z

CBS begrip
label: CBS concept @en

Begrippen CBS
type: ConceptScheme
preferred label: Concepts Statistics Netherlands @en