Diensten
narrower: Niet-commerciële dienstverlening
type: Concept

Dienstverlening
related: Niet-commerciële dienstverlening
type: Concept
type: CBS begrip

Niet-commerciële dienstverlening
type: Concept
type: CBS begrip
in scheme: Begrippen CBS
preferred label: Non-commercial services @en
definition: Dienstverlening niet gericht op het maken van winst.
definition: Services that are not primarily engaged in profit making. SIC sections O-U. These include: public administration and defence; compulsory social security; education; health and social work; other community, social and personal service activities, recreatio @en
version info: 1
broader: Diensten
scope note: Het totaal van de SBI-secties O t/m U, daardoor omvattend: O Openbaar bestuur, overheidsdiensten en verplichte sociale verzekeringen P Onderwijs Q Gezondheids- en welzijnszorg R Cultuur, sport en recreatie S Overige dienstverlening T Huishoudens als werkgever; niet-gedifferentieerde productie van goederen en diensten door huishoudens voor eigen gebruik U Extraterritoriale organisaties en lichamen
source: niet-commerciele-dienstverlening
modified: 2022-02-23T15:54:32Z
created: 2016-03-23T09:11:14Z
related: Dienstverlening

CBS begrip
label: CBS concept @en

Begrippen CBS
type: ConceptScheme
preferred label: Concepts Statistics Netherlands @en