Verkeer en vervoer
narrower: Binnenvloot, actieve
type: Concept

Binnenvloot, actieve
type: Concept
type: CBS begrip
in scheme: Begrippen CBS
preferred label: Active inland fleet @en
definition: Alle schepen die in de loop van het desbetreffende verslagjaar hebben deelgenomen aan het binnenlandse en/of internationale vervoer via de binnenvaart.
definition: All vessels participating in national and/or international shipping on inland waterways in a given year. @en
version info: 1
broader: Verkeer en vervoer
source: binnenvloot-actieve
modified: 2022-02-23T15:52:49Z
created: 2016-03-23T09:09:08Z

CBS begrip
label: CBS concept @en

Begrippen CBS
type: ConceptScheme
preferred label: Concepts Statistics Netherlands @en