Onderwijs
narrower: Voorbereidend wetenschappelijk onderwijs (Jongeren)
type: Concept

Wetenschappelijk onderwijs
related: Voorbereidend wetenschappelijk onderwijs (Jongeren)
type: Concept
type: CBS begrip
preferred label: University education @en

Voorbereidend wetenschappelijk onderwijs (Jongeren)
type: Concept
type: CBS begrip
in scheme: Begrippen CBS
definition: Onderwijs bestemd voor leerlingen van 12-18 jaar met een duur van zes jaar. Hiertoe behoren de schooltypen gymnasium (klassieke talen verplicht), atheneum (zonder klassieke talen) en lyceum (klassieke talen als keuze). Het onderwijs geeft toegang tot het hoger beroepsonderwijs (hbo) en het wetenschappelijk onderwijs (wo).
version info: 1
broader: Onderwijs
scope note: Vanaf 1 augustus 1998 zijn er in de hogere leerjaren van het havo en het vwo een aantal zaken veranderd. Een belangrijk onderdeel van de wijzigingen is de invoering van de zogenaamde profielen, waardoor de vrije keuze van examenvakken in het havo en het vwo grotendeels komt te vervallen. Er zijn vier profielen: - natuur en techniek, - natuur en gezondheid, - economie en maatschappij, - cultuur en maatschappij.
source: voorbereidend-wetenschappelijk-onderwijs--jongeren--
modified: 2022-02-23T15:56:14Z
created: 2016-03-23T09:17:25Z
related: Wetenschappelijk onderwijs

CBS begrip
label: CBS concept @en

Begrippen CBS
type: ConceptScheme
preferred label: Concepts Statistics Netherlands @en