Arbeid en sociale zekerheid
narrower: Arbeidspositie
type: Concept

Arbeidspositie
type: Concept
type: CBS begrip
in scheme: Begrippen CBS
preferred label: Position on the job market @en
definition: Classification of the population into: - the employed labour force, - the unemployed labour force, - persons not in the labour force @en
definition: Indeling van de bevolking in: - werkzame beroepsbevolking, - werkloze beroepsbevolking, - niet-beroepsbevolking.
version info: 1
broader: Arbeid en sociale zekerheid
scope note: Deze indeling heeft betrekking op personen die in Nederland wonen (exclusief de institutionele bevolking). De gegevens worden meestal gepresenteerd voor de bevolking van 15 tot 75 jaar.
source: arbeidspositie
modified: 2022-02-23T15:52:26Z
created: 2016-03-23T09:05:21Z

CBS begrip
label: CBS concept @en

Begrippen CBS
type: ConceptScheme
preferred label: Concepts Statistics Netherlands @en